{"text_format":"3","workbook":"xlsx","n_sheets":3,"sheets":["Stundennachweis_Abrechnung","Datentabelle","Drop Down"],"not_rendered":{"images":1,"defined_names":5,"comments":1},"read":"whole","date_system":"1900"}

{"sheet":"Stundennachweis_Abrechnung","index":0,"n_rows":31,"n_cols":13,"rows_kept":31,"merged":[[2,1,2,4],[2,8,4,10],[4,1,4,4],[5,0,5,3],[6,1,6,4],[6,5,6,6],[6,7,6,8],[8,0,8,3],[8,4,8,6],[8,7,8,8],[8,10,8,12],[9,0,10,0],[9,1,10,1],[9,2,10,2],[9,3,10,3],[9,4,10,4],[9,5,10,5],[9,6,10,6],[9,7,9,8],[9,10,10,10],[9,11,10,11],[9,12,10,12],[25,0,25,1],[25,3,25,4],[25,10,25,11],[26,0,26,1],[26,3,26,4],[29,0,29,1],[29,3,29,4],[30,0,30,1],[30,3,30,4]]}
["Abrechnungsnachweis kirchenmusikalischer Tätigkeiten und Stundennachweis nach Mindestlohngesetz",{"$nulls":7},"Version 4.0 / ab Juni 2023"]
[]
["Arbeitnehmer/in:",{"$nulls":4},"Abrechnungszeitraum (Kalendermonat/Jahr)",null,null,"Hinweis: Das Formular ist am Monatsende bei der zuständigen personalverwaltenden Dienststelle einzureichen."]
[]
["Einstufung/\nEntgeltsatz nach Entgeltstufe"]
[]
["Arbeitgeber:"]
[]
["Dokumentation: Arbeitszeit nach MiLoG",{"$nulls":3},"Abrechnungsrelevante Daten",null,null,"Fahrtkostenzuschuss",null,null,"Berechnung des Entgelts"]
["Datum","Beginn ","Ende ","Arbeitszeit abzüglich Pausen (in Stunden:\nMinuten)","1) Anlass / Gottesdienst und","Tätigkeit","2) Chorproben / sonstige Tätigkeiten","nur sofern im begründeten Ausnahmefall vertraglich vereinbart",null,null,"Vergütungs-satz","Vergütungs-satz sonstige Tätigkeiten","Summe"]
[{"$nulls":7},"Kilometer Wegstrecke KFZ","Fahrtkosten-ersatz ÖPNV","Hilfsspalte Fahrtkosten"]
[{"$nulls":9},{"$f":"ROUND(IF(AND(H12<=5,I12=\"\"),MIN(11,I12*1),MIN(H12*0.3+I12,11)),2)","v":0},{"$f":"IF(ISNA(INDEX(Datentabelle!A:O,MATCH(E12&F12,Datentabelle!A:A&Datentabelle!B:B,0),MATCH($B$5,Datentabelle!$A$1:$O$1,0))),0,INDEX(Datentabelle!A:O,MATCH(E12&F12,Datentabelle!A:A&Datentabelle!B:B,0),MATCH($B$5,Datentabelle!$A$1:$O$1,0)))","v":0},{"$f":"IF(ISNA(INDEX(Datentabelle!T:AG,MATCH(Stundennachweis_Abrechnung!G12,Datentabelle!T:T,0),MATCH(Stundennachweis_Abrechnung!$B$5,Datentabelle!$T$1:$AG$1,0))),0,INDEX(Datentabelle!T:AG,MATCH(Stundennachweis_Abrechnung!G12,Datentabelle!T:T,0),MATCH(Stundennachweis_Abrechnung!$B$5,Datentabelle!$T$1:$AG$1,0)))","v":0},{"$f":"ROUND(K12+IF(G12='Drop Down'!$E$14,L12*((D12-INT(D12))*24),Stundennachweis_Abrechnung!L12),2)","v":0}]
[{"$nulls":9},{"$f":"ROUND(IF(AND(H13<=5,I13=\"\"),MIN(11,I13*1),MIN(H13*0.3+I13,11)),2)","v":0},{"$f":"IF(ISNA(INDEX(Datentabelle!A:O,MATCH(E13&F13,Datentabelle!A:A&Datentabelle!B:B,0),MATCH($B$5,Datentabelle!$A$1:$O$1,0))),0,INDEX(Datentabelle!A:O,MATCH(E13&F13,Datentabelle!A:A&Datentabelle!B:B,0),MATCH($B$5,Datentabelle!$A$1:$O$1,0)))","v":0},{"$f":"IF(ISNA(INDEX(Datentabelle!T:AG,MATCH(Stundennachweis_Abrechnung!G13,Datentabelle!T:T,0),MATCH(Stundennachweis_Abrechnung!$B$5,Datentabelle!$T$1:$AG$1,0))),0,INDEX(Datentabelle!T:AG,MATCH(Stundennachweis_Abrechnung!G13,Datentabelle!T:T,0),MATCH(Stundennachweis_Abrechnung!$B$5,Datentabelle!$T$1:$AG$1,0)))","v":0},{"$f":"ROUND(K13+IF(G13='Drop Down'!$E$14,L13*((D13-INT(D13))*24),Stundennachweis_Abrechnung!L13),2)","v":0}]
[{"$nulls":9},0,{"$f":"IF(ISNA(INDEX(Datentabelle!A:O,MATCH(E14&F14,Datentabelle!A:A&Datentabelle!B:B,0),MATCH($B$5,Datentabelle!$A$1:$O$1,0))),0,INDEX(Datentabelle!A:O,MATCH(E14&F14,Datentabelle!A:A&Datentabelle!B:B,0),MATCH($B$5,Datentabelle!$A$1:$O$1,0)))","v":0},{"$f":"IF(ISNA(INDEX(Datentabelle!T:AG,MATCH(Stundennachweis_Abrechnung!G14,Datentabelle!T:T,0),MATCH(Stundennachweis_Abrechnung!$B$5,Datentabelle!$T$1:$AG$1,0))),0,INDEX(Datentabelle!T:AG,MATCH(Stundennachweis_Abrechnung!G14,Datentabelle!T:T,0),MATCH(Stundennachweis_Abrechnung!$B$5,Datentabelle!$T$1:$AG$1,0)))","v":0},{"$f":"ROUND(K14+IF(G14='Drop Down'!$E$14,L14*((D14-INT(D14))*24),Stundennachweis_Abrechnung!L14),2)","v":0}]
[{"$nulls":9},0,{"$f":"IF(ISNA(INDEX(Datentabelle!A:O,MATCH(E15&F15,Datentabelle!A:A&Datentabelle!B:B,0),MATCH($B$5,Datentabelle!$A$1:$O$1,0))),0,INDEX(Datentabelle!A:O,MATCH(E15&F15,Datentabelle!A:A&Datentabelle!B:B,0),MATCH($B$5,Datentabelle!$A$1:$O$1,0)))","v":0},{"$f":"IF(ISNA(INDEX(Datentabelle!T:AG,MATCH(Stundennachweis_Abrechnung!G15,Datentabelle!T:T,0),MATCH(Stundennachweis_Abrechnung!$B$5,Datentabelle!$T$1:$AG$1,0))),0,INDEX(Datentabelle!T:AG,MATCH(Stundennachweis_Abrechnung!G15,Datentabelle!T:T,0),MATCH(Stundennachweis_Abrechnung!$B$5,Datentabelle!$T$1:$AG$1,0)))","v":0},{"$f":"ROUND(K15+IF(G15='Drop Down'!$E$14,L15*((D15-INT(D15))*24),Stundennachweis_Abrechnung!L15),2)","v":0}]
[{"$nulls":9},0,{"$f":"IF(ISNA(INDEX(Datentabelle!A:O,MATCH(E16&F16,Datentabelle!A:A&Datentabelle!B:B,0),MATCH($B$5,Datentabelle!$A$1:$O$1,0))),0,INDEX(Datentabelle!A:O,MATCH(E16&F16,Datentabelle!A:A&Datentabelle!B:B,0),MATCH($B$5,Datentabelle!$A$1:$O$1,0)))","v":0},{"$f":"IF(ISNA(INDEX(Datentabelle!T:AG,MATCH(Stundennachweis_Abrechnung!G16,Datentabelle!T:T,0),MATCH(Stundennachweis_Abrechnung!$B$5,Datentabelle!$T$1:$AG$1,0))),0,INDEX(Datentabelle!T:AG,MATCH(Stundennachweis_Abrechnung!G16,Datentabelle!T:T,0),MATCH(Stundennachweis_Abrechnung!$B$5,Datentabelle!$T$1:$AG$1,0)))","v":0},{"$f":"ROUND(K16+IF(G16='Drop Down'!$E$14,L16*((D16-INT(D16))*24),Stundennachweis_Abrechnung!L16),2)","v":0}]
[{"$nulls":9},0,{"$f":"IF(ISNA(INDEX(Datentabelle!A:O,MATCH(E17&F17,Datentabelle!A:A&Datentabelle!B:B,0),MATCH($B$5,Datentabelle!$A$1:$O$1,0))),0,INDEX(Datentabelle!A:O,MATCH(E17&F17,Datentabelle!A:A&Datentabelle!B:B,0),MATCH($B$5,Datentabelle!$A$1:$O$1,0)))","v":0},{"$f":"IF(ISNA(INDEX(Datentabelle!T:AG,MATCH(Stundennachweis_Abrechnung!G17,Datentabelle!T:T,0),MATCH(Stundennachweis_Abrechnung!$B$5,Datentabelle!$T$1:$AG$1,0))),0,INDEX(Datentabelle!T:AG,MATCH(Stundennachweis_Abrechnung!G17,Datentabelle!T:T,0),MATCH(Stundennachweis_Abrechnung!$B$5,Datentabelle!$T$1:$AG$1,0)))","v":0},{"$f":"ROUND(K17+IF(G17='Drop Down'!$E$14,L17*((D17-INT(D17))*24),Stundennachweis_Abrechnung!L17),2)","v":0}]
[{"$nulls":9},0,{"$f":"IF(ISNA(INDEX(Datentabelle!A:O,MATCH(E18&F18,Datentabelle!A:A&Datentabelle!B:B,0),MATCH($B$5,Datentabelle!$A$1:$O$1,0))),0,INDEX(Datentabelle!A:O,MATCH(E18&F18,Datentabelle!A:A&Datentabelle!B:B,0),MATCH($B$5,Datentabelle!$A$1:$O$1,0)))","v":0},{"$f":"IF(ISNA(INDEX(Datentabelle!T:AG,MATCH(Stundennachweis_Abrechnung!G18,Datentabelle!T:T,0),MATCH(Stundennachweis_Abrechnung!$B$5,Datentabelle!$T$1:$AG$1,0))),0,INDEX(Datentabelle!T:AG,MATCH(Stundennachweis_Abrechnung!G18,Datentabelle!T:T,0),MATCH(Stundennachweis_Abrechnung!$B$5,Datentabelle!$T$1:$AG$1,0)))","v":0},{"$f":"ROUND(K18+IF(G18='Drop Down'!$E$14,L18*((D18-INT(D18))*24),Stundennachweis_Abrechnung!L18),2)","v":0}]
[null,null," ",{"$nulls":6},0,{"$f":"IF(ISNA(INDEX(Datentabelle!A:O,MATCH(E19&F19,Datentabelle!A:A&Datentabelle!B:B,0),MATCH($B$5,Datentabelle!$A$1:$O$1,0))),0,INDEX(Datentabelle!A:O,MATCH(E19&F19,Datentabelle!A:A&Datentabelle!B:B,0),MATCH($B$5,Datentabelle!$A$1:$O$1,0)))","v":0},{"$f":"IF(ISNA(INDEX(Datentabelle!T:AG,MATCH(Stundennachweis_Abrechnung!G19,Datentabelle!T:T,0),MATCH(Stundennachweis_Abrechnung!$B$5,Datentabelle!$T$1:$AG$1,0))),0,INDEX(Datentabelle!T:AG,MATCH(Stundennachweis_Abrechnung!G19,Datentabelle!T:T,0),MATCH(Stundennachweis_Abrechnung!$B$5,Datentabelle!$T$1:$AG$1,0)))","v":0},{"$f":"ROUND(K19+IF(G19='Drop Down'!$E$14,L19*((D19-INT(D19))*24),Stundennachweis_Abrechnung!L19),2)","v":0}]
[{"$nulls":9},0,{"$f":"IF(ISNA(INDEX(Datentabelle!A:O,MATCH(E20&F20,Datentabelle!A:A&Datentabelle!B:B,0),MATCH($B$5,Datentabelle!$A$1:$O$1,0))),0,INDEX(Datentabelle!A:O,MATCH(E20&F20,Datentabelle!A:A&Datentabelle!B:B,0),MATCH($B$5,Datentabelle!$A$1:$O$1,0)))","v":0},{"$f":"IF(ISNA(INDEX(Datentabelle!T:AG,MATCH(Stundennachweis_Abrechnung!G20,Datentabelle!T:T,0),MATCH(Stundennachweis_Abrechnung!$B$5,Datentabelle!$T$1:$AG$1,0))),0,INDEX(Datentabelle!T:AG,MATCH(Stundennachweis_Abrechnung!G20,Datentabelle!T:T,0),MATCH(Stundennachweis_Abrechnung!$B$5,Datentabelle!$T$1:$AG$1,0)))","v":0},{"$f":"ROUND(K20+IF(G20='Drop Down'!$E$14,L20*((D20-INT(D20))*24),Stundennachweis_Abrechnung!L20),2)","v":0}]
{"$rows_left_out":12}
{"sheet":"Datentabelle","index":1,"n_rows":43,"n_cols":33,"rows_kept":43,"hidden":true}
["Anlass Gottesdienst","Tätigkeit","DE","A","B+50% (Besitzstand gem. § 16 Abs. 2 Anlage 4f zur AVO)","B","90%B","C+50%  (Besitzstand gem. § 16 Abs. 2 Anlage 4f zur AVO)","80%B","C","D+50% (Besitzstand gem. § 16 Abs. 2 Anlage 4f zur AVO)","95%C","D","B (Besitzstand gem. § 16 Abs. 1 Anlage 4f zur AVO)","90%B (Besitzstand nach § 16 Abs. 2 Anlage 4f zur AVO)",{"$nulls":4},"sonstige Tätigkeit","Diensteinheiten","A","B+50% (Besitzstand gem. § 16 Abs. 2 Anlage 4f zur AVO)","B","90%B","C+50%  (Besitzstand gem. § 16 Abs. 2 Anlage 4f zur AVO)","80%B","C","D+50% (Besitzstand gem. § 16 Abs. 2 Anlage 4f zur AVO)","95%C","D","B (Besitzstand gem. § 16 Abs. 1 Anlage 4f zur AVO)","90%B (Besitzstand nach § 16 Abs. 2 Anlage 4f zur AVO)"]
["Gottesdienste an Sonntagen (einschl. Vorabend) und Feiertagen","Orgelspiel",1,{"v":60.65,"d":"60.65 €"},{"$f":"ROUND(F2+(D2-F2)*0.5,2)","v":{"v":55.74,"d":"55.74 €"}},{"v":50.83,"d":"50.83 €"},{"$f":"ROUND(0.9*F2,2)","v":{"v":45.75,"d":"45.75 €"}},{"$f":"ROUND(J2+(F2-J2)*0.5,2)","v":{"v":44.44,"d":"44.44 €"}},{"$f":"ROUND(0.8*F2,2)","v":{"v":40.66,"d":"40.66 €"}},{"v":38.05,"d":"38.05 €"},{"$f":"ROUND(M2+(J2-M2)*0.5,2)","v":{"v":36.67,"d":"36.67 €"}},{"$f":"ROUND(0.95*J2,2)","v":{"v":36.15,"d":"36.15 €"}},{"v":35.28,"d":"35.28 €"},{"v":50.83,"d":"50.830 €"},{"$f":"ROUND(0.9*N2,2)","v":{"v":45.75,"d":"45.750 €"}},{"$nulls":4},"Chorprobe/Ensembleprobe bis einschl. 60 min",1,{"v":60.65,"d":"60.650 €"},{"$f":"ROUND(X2+(V2-X2)*0.5,2)","v":{"v":55.74,"d":"55.740 €"}},{"v":50.83,"d":"50.830 €"},{"$f":"ROUND(0.9*X2,2)","v":{"v":45.75,"d":"45.750 €"}},{"$f":"ROUND(AB2+(X2-AB2)*0.5,2)","v":{"v":44.44,"d":"44.440 €"}},{"$f":"ROUND(0.8*X2,2)","v":{"v":40.66,"d":"40.660 €"}},{"v":38.05,"d":"38.050 €"},{"$f":"ROUND(AE2+(AB2-AE2)*0.5,2)","v":{"v":36.67,"d":"36.670 €"}},{"$f":"ROUND(0.95*AB2,2)","v":{"v":36.15,"d":"36.150 €"}},{"v":35.28,"d":"35.280 €"},{"v":50.83,"d":"50.830 €"},{"$f":"ROUND(0.9*AF2,2)","v":{"v":45.75,"d":"45.750 €"}}]
["Gottesdienste an Sonntagen (einschl. Vorabend) und Feiertagen","Chorleitung (mit Einsingen)",1.5,{"v":90.98,"d":"90.98 €"},{"$f":"ROUND(F3+(D3-F3)*0.5,2)","v":{"v":83.62,"d":"83.62 €"}},{"v":76.25,"d":"76.25 €"},{"$f":"ROUND(0.9*F3,2)","v":{"v":68.63,"d":"68.63 €"}},{"$f":"ROUND(J3+(F3-J3)*0.5,2)","v":{"v":66.67,"d":"66.67 €"}},{"$f":"ROUND(0.8*F3,2)","v":{"v":61,"d":"61.00 €"}},{"v":57.08,"d":"57.08 €"},{"$f":"ROUND(M3+(J3-M3)*0.5,2)","v":{"v":55.01,"d":"55.01 €"}},{"$f":"ROUND(0.95*J3,2)","v":{"v":54.23,"d":"54.23 €"}},{"v":52.93,"d":"52.93 €"},{"v":76.25,"d":"76.250 €"},{"$f":"ROUND(0.9*N3,2)","v":{"v":68.63,"d":"68.630 €"}},{"$nulls":4},"Chorprobe/Ensembleprobe bis einschl. 90 min",1.5,{"v":90.98,"d":"90.980 €"},{"v":83.62,"d":"83.620 €"},{"v":76.25,"d":"76.250 €"},{"v":68.63,"d":"68.630 €"},{"v":66.67,"d":"66.670 €"},{"v":61,"d":"61.000 €"},{"v":57.08,"d":"57.080 €"},{"v":55.01,"d":"55.010 €"},{"$f":"ROUND(0.95*AB3,2)","v":{"v":54.23,"d":"54.230 €"}},{"v":52.93,"d":"52.930 €"},{"v":76.25,"d":"76.250 €"},{"$f":"ROUND(0.9*AF3,2)","v":{"v":68.63,"d":"68.630 €"}}]
["Gottesdienste an Sonntagen (einschl. Vorabend) und Feiertagen","Orgelspiel und Chorleitung (mit Einsingen)",1.5,{"v":90.98,"d":"90.98 €"},{"v":83.62,"d":"83.62 €"},{"v":76.25,"d":"76.25 €"},{"v":68.63,"d":"68.63 €"},{"v":66.67,"d":"66.67 €"},{"v":61,"d":"61.00 €"},{"v":57.08,"d":"57.08 €"},{"v":55.01,"d":"55.01 €"},{"v":54.23,"d":"54.23 €"},{"v":52.93,"d":"52.93 €"},{"v":76.25,"d":"76.250 €"},{"$f":"ROUND(0.9*N4,2)","v":{"v":68.63,"d":"68.630 €"}},{"$nulls":4},"Chorprobe/Ensembleprobe bis einschl. 120 min",2,{"v":121.3,"d":"121.300 €"},{"v":111.49,"d":"111.490 €"},{"v":101.67,"d":"101.670 €"},{"v":91.5,"d":"91.500 €"},{"v":88.89,"d":"88.890 €"},{"v":81.34,"d":"81.340 €"},{"v":76.1,"d":"76.100 €"},{"v":73.34,"d":"73.340 €"},{"v":72.3,"d":"72.300 €"},{"v":70.57,"d":"70.570 €"},{"v":101.67,"d":"101.670 €"},{"v":91.5,"d":"91.500 €"}]
["Werktagsgottesdienst","Orgelspiel",1,{"v":60.65,"d":"60.65 €"},{"v":55.74,"d":"55.74 €"},{"v":50.83,"d":"50.83 €"},{"v":45.75,"d":"45.75 €"},{"v":44.44,"d":"44.44 €"},{"v":40.66,"d":"40.66 €"},{"v":38.05,"d":"38.05 €"},{"v":36.67,"d":"36.67 €"},{"v":36.15,"d":"36.15 €"},{"v":35.28,"d":"35.28 €"},{"v":50.83,"d":"50.830 €"},{"v":45.75,"d":"45.750 €"},{"$nulls":4},"Chorprobe mit Kinder- und Jugendchor bis einschl. 60 min",1,{"v":60.65,"d":"60.650 €"},{"v":55.74,"d":"55.740 €"},{"v":50.83,"d":"50.830 €"},{"v":45.75,"d":"45.750 €"},{"v":44.44,"d":"44.440 €"},{"v":40.66,"d":"40.660 €"},{"v":38.05,"d":"38.050 €"},{"v":36.67,"d":"36.670 €"},{"v":36.15,"d":"36.150 €"},{"v":35.28,"d":"35.280 €"},{"v":50.83,"d":"50.830 €"},{"v":45.75,"d":"45.750 €"}]
["Werktagsgottesdienst","Chorleitung (mit Einsingen)",1.5,{"v":90.98,"d":"90.98 €"},{"$f":"ROUND(F6+(D6-F6)*0.5,2)","v":{"v":83.62,"d":"83.62 €"}},{"v":76.25,"d":"76.25 €"},{"v":68.63,"d":"68.63 €"},{"v":66.67,"d":"66.67 €"},{"v":61,"d":"61.00 €"},{"v":57.08,"d":"57.08 €"},{"v":55.01,"d":"55.01 €"},{"v":54.23,"d":"54.23 €"},{"v":52.93,"d":"52.93 €"},{"v":50.83,"d":"50.830 €"},{"v":45.75,"d":"45.750 €"},{"$nulls":4},"Chorprobe mit Kinder- und Jugendchor bis einschl. 90 min",1.5,{"v":90.98,"d":"90.980 €"},{"v":83.62,"d":"83.620 €"},{"v":76.25,"d":"76.250 €"},{"v":68.63,"d":"68.630 €"},{"v":66.67,"d":"66.670 €"},{"v":61,"d":"61.000 €"},{"v":57.08,"d":"57.080 €"},{"v":55.01,"d":"55.010 €"},{"v":54.23,"d":"54.230 €"},{"v":52.93,"d":"52.930 €"},{"v":76.25,"d":"76.250 €"},{"v":68.63,"d":"68.630 €"}]
["Werktagsgottesdienst","Orgelspiel und Chorleitung (mit Einsingen)",1.5,{"v":90.98,"d":"90.98 €"},{"$f":"ROUND(F7+(D7-F7)*0.5,2)","v":{"v":83.62,"d":"83.62 €"}},{"v":76.25,"d":"76.25 €"},{"v":68.63,"d":"68.63 €"},{"v":66.67,"d":"66.67 €"},{"v":61,"d":"61.00 €"},{"v":57.08,"d":"57.08 €"},{"v":55.01,"d":"55.01 €"},{"v":54.23,"d":"54.23 €"},{"v":52.93,"d":"52.93 €"},{"v":50.83,"d":"50.830 €"},{"v":45.75,"d":"45.750 €"},{"$nulls":4},"Prozession mit Chorgesang bis einschl. 60 min",1,{"v":60.65,"d":"60.650 €"},{"v":55.74,"d":"55.740 €"},{"v":50.83,"d":"50.830 €"},{"v":45.75,"d":"45.750 €"},{"v":44.44,"d":"44.440 €"},{"v":40.66,"d":"40.660 €"},{"v":38.05,"d":"38.050 €"},{"v":36.67,"d":"36.670 €"},{"v":36.15,"d":"36.150 €"},{"v":35.28,"d":"35.280 €"},{"v":50.83,"d":"50.830 €"},{"v":45.75,"d":"45.750 €"}]
["Christmette","Orgelspiel",2,{"v":121.3,"d":"121.30 €"},{"v":111.49,"d":"111.49 €"},{"v":101.67,"d":"101.67 €"},{"v":91.5,"d":"91.50 €"},{"v":88.89,"d":"88.89 €"},{"v":81.34,"d":"81.34 €"},{"v":76.1,"d":"76.10 €"},{"v":73.34,"d":"73.34 €"},{"v":72.3,"d":"72.30 €"},{"v":70.57,"d":"70.57 €"},{"v":101.67,"d":"101.670 €"},{"v":91.5,"d":"91.500 €"},{"$nulls":4},"Prozession mit Chorgesang bis einschl. 90 min",1.5,{"v":90.98,"d":"90.980 €"},{"v":83.62,"d":"83.620 €"},{"v":76.25,"d":"76.250 €"},{"v":68.63,"d":"68.630 €"},{"v":66.67,"d":"66.670 €"},{"v":61,"d":"61.000 €"},{"v":57.08,"d":"57.080 €"},{"v":55.01,"d":"55.010 €"},{"v":54.23,"d":"54.230 €"},{"v":52.93,"d":"52.930 €"},{"v":76.25,"d":"76.250 €"},{"v":68.63,"d":"68.630 €"}]
["Christmette","Chorleitung (mit Einsingen)",2.5,{"v":151.63,"d":"151.63 €"},{"v":139.36,"d":"139.36 €"},{"v":127.08,"d":"127.08 €"},{"v":114.37,"d":"114.37 €"},{"v":111.11,"d":"111.11 €"},{"v":101.66,"d":"101.66 €"},{"v":95.13,"d":"95.13 €"},{"v":91.67,"d":"91.67 €"},{"v":90.37,"d":"90.37 €"},{"v":88.21,"d":"88.21 €"},{"v":101.67,"d":"101.670 €"},{"v":91.5,"d":"91.500 €"},{"$nulls":4},"Unterricht bis einschl. 30 min",0.5,{"v":30.33,"d":"30.330 €"},{"v":27.88,"d":"27.880 €"},{"v":25.42,"d":"25.420 €"},{"v":22.88,"d":"22.880 €"},{"v":22.23,"d":"22.230 €"},{"v":20.34,"d":"20.340 €"},{"v":19.03,"d":"19.030 €"},{"v":18.34,"d":"18.340 €"},{"v":18.08,"d":"18.080 €"},{"v":17.64,"d":"17.640 €"},{"v":25.42,"d":"25.420 €"},{"v":22.88,"d":"22.880 €"}]
["Christmette","Orgelspiel und Chorleitung (mit Einsingen)",2.5,{"v":151.63,"d":"151.63 €"},{"v":139.36,"d":"139.36 €"},{"v":127.08,"d":"127.08 €"},{"v":114.37,"d":"114.37 €"},{"v":111.11,"d":"111.11 €"},{"v":101.66,"d":"101.66 €"},{"v":95.13,"d":"95.13 €"},{"v":91.67,"d":"91.67 €"},{"v":90.37,"d":"90.37 €"},{"v":88.21,"d":"88.21 €"},{"v":101.67,"d":"101.670 €"},{"v":91.5,"d":"91.500 €"},{"$nulls":4},"Unterricht bis einschl. 60 min",1,{"v":60.65,"d":"60.650 €"},{"v":55.74,"d":"55.740 €"},{"v":50.83,"d":"50.830 €"},{"v":45.75,"d":"45.750 €"},{"v":44.44,"d":"44.440 €"},{"v":40.66,"d":"40.660 €"},{"v":38.05,"d":"38.050 €"},{"v":36.67,"d":"36.670 €"},{"v":36.15,"d":"36.150 €"},{"v":35.28,"d":"35.280 €"},{"v":50.83,"d":"50.830 €"},{"v":45.75,"d":"45.750 €"}]
["Kinderchristmette","Orgelspiel",1,{"v":60.65,"d":"60.65 €"},{"v":55.74,"d":"55.74 €"},{"v":50.83,"d":"50.83 €"},{"v":45.75,"d":"45.75 €"},{"v":44.44,"d":"44.44 €"},{"v":40.66,"d":"40.66 €"},{"v":38.05,"d":"38.05 €"},{"v":36.67,"d":"36.67 €"},{"v":36.15,"d":"36.15 €"},{"v":35.28,"d":"35.28 €"},{"v":101.67,"d":"101.670 €"},{"v":91.5,"d":"91.500 €"},{"$nulls":4},"Konzertdauer bis einschl. 60 Minuten + Einsingen/Einspielen",1.5,{"v":90.98,"d":"90.980 €"},{"v":83.62,"d":"83.620 €"},{"v":76.25,"d":"76.250 €"},{"v":68.63,"d":"68.630 €"},{"v":66.67,"d":"66.670 €"},{"v":61,"d":"61.000 €"},{"v":57.08,"d":"57.080 €"},{"v":55.01,"d":"55.010 €"},{"v":54.23,"d":"54.230 €"},{"v":52.93,"d":"52.930 €"},{"v":76.25,"d":"76.250 €"},{"v":68.63,"d":"68.630 €"}]
["Kinderchristmette","Chorleitung (mit Einsingen)",1.5,{"v":90.98,"d":"90.98 €"},{"v":83.62,"d":"83.62 €"},{"v":76.25,"d":"76.25 €"},{"v":68.63,"d":"68.63 €"},{"v":66.67,"d":"66.67 €"},{"v":61,"d":"61.00 €"},{"v":57.08,"d":"57.08 €"},{"v":55.01,"d":"55.01 €"},{"v":54.23,"d":"54.23 €"},{"v":52.93,"d":"52.93 €"},{"v":76.25,"d":"76.250 €"},{"v":68.63,"d":"68.630 €"},{"$nulls":4},"Konzertdauer bis einschl. 90 Minuten + Einsingen/Einspielen",2,{"v":121.3,"d":"121.300 €"},{"v":111.49,"d":"111.490 €"},{"v":101.67,"d":"101.670 €"},{"v":91.5,"d":"91.500 €"},{"v":88.89,"d":"88.890 €"},{"v":81.34,"d":"81.340 €"},{"v":76.1,"d":"76.100 €"},{"v":73.34,"d":"73.340 €"},{"v":72.3,"d":"72.300 €"},{"v":70.57,"d":"70.570 €"},{"v":101.67,"d":"101.670 €"},{"v":91.5,"d":"91.500 €"}]
["Kinderchristmette","Orgelspiel und Chorleitung (mit Einsingen)",1.5,{"v":90.98,"d":"90.98 €"},{"v":83.62,"d":"83.62 €"},{"v":76.25,"d":"76.25 €"},{"v":68.63,"d":"68.63 €"},{"v":66.67,"d":"66.67 €"},{"v":61,"d":"61.00 €"},{"v":57.08,"d":"57.08 €"},{"v":55.01,"d":"55.01 €"},{"v":54.23,"d":"54.23 €"},{"v":52.93,"d":"52.93 €"},{"v":76.25,"d":"76.250 €"},{"v":68.63,"d":"68.630 €"},{"$nulls":4},"Konzertdauer über 90 Minuten + Einsingen/Einspielen",2.5,{"v":151.63,"d":"151.630 €"},{"v":139.36,"d":"139.360 €"},{"v":127.08,"d":"127.080 €"},{"v":114.37,"d":"114.370 €"},{"v":111.11,"d":"111.110 €"},{"v":101.66,"d":"101.660 €"},{"v":95.13,"d":"95.130 €"},{"v":91.67,"d":"91.670 €"},{"v":90.37,"d":"90.370 €"},{"v":88.21,"d":"88.210 €"},{"v":127.08,"d":"127.080 €"},{"v":114.37,"d":"114.370 €"}]
["Gottesdienst in der Osternacht","Orgelspiel",2,{"v":121.3,"d":"121.30 €"},{"v":111.49,"d":"111.49 €"},{"v":101.67,"d":"101.67 €"},{"v":91.5,"d":"91.50 €"},{"v":88.89,"d":"88.89 €"},{"v":81.34,"d":"81.34 €"},{"v":76.1,"d":"76.10 €"},{"v":73.34,"d":"73.34 €"},{"v":72.3,"d":"72.30 €"},{"v":70.57,"d":"70.57 €"},{"v":101.67,"d":"101.670 €"},{"v":91.5,"d":"91.500 €"},{"$nulls":4},{"$f":"'Drop Down'!E14","v":"Sonstige vereinbarte Tätigkeit gem. § 12 Abs. 3 Anlage 4f zur AVO"},null,{"v":36.39,"d":"36.390 €"},{"v":33.45,"d":"33.450 €"},{"v":30.5,"d":"30.500 €"},{"v":27.45,"d":"27.450 €"},{"v":26.67,"d":"26.670 €"},{"v":24.4,"d":"24.400 €"},{"v":22.83,"d":"22.830 €"},{"v":22,"d":"22.000 €"},{"v":21.69,"d":"21.690 €"},{"v":21.17,"d":"21.170 €"},{"v":30.5,"d":"30.500 €"},{"v":27.45,"d":"27.450 €"}]
["Gottesdienst in der Osternacht","Chorleitung (mit Einsingen)",2.5,{"v":151.63,"d":"151.63 €"},{"v":139.36,"d":"139.36 €"},{"v":127.08,"d":"127.08 €"},{"v":114.37,"d":"114.37 €"},{"v":111.11,"d":"111.11 €"},{"v":101.66,"d":"101.66 €"},{"v":95.13,"d":"95.13 €"},{"v":91.67,"d":"91.67 €"},{"v":90.37,"d":"90.37 €"},{"v":88.21,"d":"88.21 €"},{"v":101.67,"d":"101.670 €"},{"v":91.5,"d":"91.500 €"}]
["Gottesdienst in der Osternacht","Orgelspiel und Chorleitung (mit Einsingen)",2.5,{"v":151.63,"d":"151.63 €"},{"v":139.36,"d":"139.36 €"},{"v":127.08,"d":"127.08 €"},{"v":114.37,"d":"114.37 €"},{"v":111.11,"d":"111.11 €"},{"v":101.66,"d":"101.66 €"},{"v":95.13,"d":"95.13 €"},{"v":91.67,"d":"91.67 €"},{"v":90.37,"d":"90.37 €"},{"v":88.21,"d":"88.21 €"},{"v":101.67,"d":"101.670 €"},{"v":91.5,"d":"91.500 €"}]
["Gottesdienst am Gründonnerstag","Orgelspiel",1,{"v":60.65,"d":"60.65 €"},{"v":55.74,"d":"55.74 €"},{"v":50.83,"d":"50.83 €"},{"v":45.75,"d":"45.75 €"},{"v":44.44,"d":"44.44 €"},{"v":40.66,"d":"40.66 €"},{"v":38.05,"d":"38.05 €"},{"v":36.67,"d":"36.67 €"},{"v":36.15,"d":"36.15 €"},{"v":35.28,"d":"35.28 €"},{"v":101.67,"d":"101.670 €"},{"v":91.5,"d":"91.500 €"}]
["Gottesdienst am Gründonnerstag","Chorleitung (mit Einsingen)",1.5,{"v":90.98,"d":"90.98 €"},{"v":83.62,"d":"83.62 €"},{"v":76.25,"d":"76.25 €"},{"v":68.63,"d":"68.63 €"},{"v":66.67,"d":"66.67 €"},{"v":61,"d":"61.00 €"},{"v":57.08,"d":"57.08 €"},{"v":55.01,"d":"55.01 €"},{"v":54.23,"d":"54.23 €"},{"v":52.93,"d":"52.93 €"},{"v":76.25,"d":"76.250 €"},{"v":68.63,"d":"68.630 €"}]
["Gottesdienst am Gründonnerstag","Orgelspiel und Chorleitung (mit Einsingen)",1.5,{"v":90.98,"d":"90.98 €"},{"v":83.62,"d":"83.62 €"},{"v":76.25,"d":"76.25 €"},{"v":68.63,"d":"68.63 €"},{"v":66.67,"d":"66.67 €"},{"v":61,"d":"61.00 €"},{"v":57.08,"d":"57.08 €"},{"v":55.01,"d":"55.01 €"},{"v":54.23,"d":"54.23 €"},{"v":52.93,"d":"52.93 €"},{"v":76.25,"d":"76.250 €"},{"v":68.63,"d":"68.630 €"}]
["Karfreitagsliturgie","Orgelspiel",1.5,{"v":90.98,"d":"90.98 €"},{"v":83.62,"d":"83.62 €"},{"v":76.25,"d":"76.25 €"},{"v":68.63,"d":"68.63 €"},{"v":66.67,"d":"66.67 €"},{"v":61,"d":"61.00 €"},{"v":57.08,"d":"57.08 €"},{"v":55.01,"d":"55.01 €"},{"v":54.23,"d":"54.23 €"},{"v":52.93,"d":"52.93 €"},{"v":76.25,"d":"76.250 €"},{"v":68.63,"d":"68.630 €"}]
{"$rows_left_out":24}
{"sheet":"Drop Down","index":2,"n_rows":227,"n_cols":15,"rows_kept":227,"hidden":true}
["Gottesdienst",null,"Tätigkeiten",null,"sonstige Tätigkeiten",null,"Qualifikation",null,"Arbeitgeber",null,"Auftraggeber",null,"GKG",null,"Fonds"]
["Gottesdienste an Sonntagen (einschl. Vorabend) und Feiertagen",null,"Orgelspiel",null,"Chorprobe/Ensembleprobe bis einschl. 60 min",null,"A",null,"Aachtal",null,"Römisch-katholische Kirchengemeinde",null,"Baden-Baden",null,"Lindenberg"]
["Werktagsgottesdienst",null,"Chorleitung (mit Einsingen)",null,"Chorprobe/Ensembleprobe bis einschl. 90 min",null,"B",null,"Achern",null,"Katholische Gesamtkirchengemeinde",null,"Freiburg"]
["Christmette",null,"Orgelspiel und Chorleitung (mit Einsingen)",null,"Chorprobe/Ensembleprobe bis einschl. 120 min",null,"90%B",null,"Achertal St. Nikolaus",null,"Erzdiözese Freiburg",null,"Karlsruhe"]
["Kinderchristmette",{"$nulls":3},"Chorprobe mit Kinder- und Jugendchor bis einschl. 60 min",null,"80%B",null,"Adelsheim-Osterburken-Seckach",null,"Kapellenfond",null,"Konstanz"]
["Gottesdienst in der Osternacht",{"$nulls":3},"Chorprobe mit Kinder- und Jugendchor bis einschl. 90 min",null,"C",null,"Aglasterhausen-Neunkirchen",{"$nulls":3},"Mannheim"]
["Gottesdienst am Gründonnerstag",{"$nulls":3},"Prozession mit Chorgesang bis einschl. 60 min",null,"95%C",null,"Am Litzelberg"]
["Karfreitagsliturgie",{"$nulls":3},"Prozession mit Chorgesang bis einschl. 90 min",null,"D",null,"An der Eschach"]
["Erstkommunionsfeiern",{"$nulls":3},"Unterricht bis einschl. 30 min",null,"B+50% (Besitzstand gem. § 16 Abs. 2 Anlage 4f zur AVO)",null,"An der Glotter"]
["Firmungen",{"$nulls":3},"Unterricht bis einschl. 60 min",null,"C+50%  (Besitzstand gem. § 16 Abs. 2 Anlage 4f zur AVO)",null,"An der Schutter"]
["Tauffeiern",{"$nulls":3},"Konzertdauer bis einschl. 60 Minuten + Einsingen/Einspielen",null,"D+50% (Besitzstand gem. § 16 Abs. 2 Anlage 4f zur AVO)",null,"An Wolf und Kinzig"]
["Trauungen",{"$nulls":3},"Konzertdauer bis einschl. 90 Minuten + Einsingen/Einspielen",null,"B (Besitzstand gem. § 16 Abs. 1 Anlage 4f zur AVO)",null,"Appenweier-Durbach"]
["Seelenamt + Aussegnung \nbzw. Trauerfeier + Aussegnung",{"$nulls":3},"Konzertdauer über 90 Minuten + Einsingen/Einspielen",null,"90%B (Besitzstand nach § 16 Abs. 2 Anlage 4f zur AVO)",null,"Auf der Baar"]
["Andachten (bis einschl. 30min)",{"$nulls":3},"Sonstige vereinbarte Tätigkeit gem. § 12 Abs. 3 Anlage 4f zur AVO",{"$nulls":3},"Bad Dürrheim"]
["Andachten (bis einschl. 60min)",{"$nulls":7},"Bad Krozingen-Hartheim"]
[{"$nulls":8},"Bad Rappenau/Obergimpern"]
[{"$nulls":8},"Bad Säckingen-Murg"]
[{"$nulls":8},"Bad Schönborn-Kronau"]
[{"$nulls":8},"Baden-Baden"]
[{"$nulls":8},"Baden-Baden-Oos"]
{"$rows_left_out":207}